Target
Bcl2-associated agonist of cell death
Ligand
BDBM50060993
Substrate
Meas. Tech.
ChEMBL_553538 (CHEMBL958721)
Kd
400000±n/a nM
Citation
 Congreve, MChessari, GTisi, DWoodhead, AJ Recent developments in fragment-based drug discovery. J Med Chem 51:3661-80 (2008)  
Target
Name:
Bcl2-associated agonist of cell death
Synonyms:
BAD BBC6 Bcl-2-binding component 6 Bcl-XL/Bcl-2-associated death promoter Bcl2-L-8 | Bcl2-antagonist of cell death (BAD)
Type:
PROTEIN
Mol. Mass.:
18393.69
Organism:
Homo sapiens (Human)
Description:
ChEMBL_478760
Residue:
168
  
Inhibitor
Name:
BDBM50060993
Synonyms:
4'-FLUORO-1,1'-BIPHENYL-4-CARBOXYLIC ACID CHEMBL106708
Type:
Small organic molecule
Emp. Form.:
C13H9FO2
Mol. Mass.:
216.2078
SMILES:
OC(=O)c1ccc(cc1)-c1ccc(F)cc1
: