Target
Lysophosphatidic acid receptor 2
Ligand
BDBM50271763
Substrate
Meas. Tech.
ChEMBL_556426 (CHEMBL955643)
IC50
21.8±n/a nM
Citation
 Fells, JITsukahara, RFujiwara, YLiu, JPerygin, DHOsborne, DATigyi, GParrill, AL Identification of non-lipid LPA3 antagonists by virtual screening. Bioorg Med Chem 16:6207-17 (2008)  
Target
Name:
Lysophosphatidic acid receptor 2
Synonyms:
EDG4 LPA-2 LPAR2 Lysophosphatidic acid receptor 2 | Lysophosphatidic acid receptor Edg-4
Type:
PROTEIN
Mol. Mass.:
39103.44
Organism:
Homo sapiens (Human)
Description:
ChEMBL_1451385
Residue:
351
  
Inhibitor
Name:
BDBM50271763
Synonyms:
3-[3-(3-Carboxy-acryloylamino)-phenylcarbamoyl]-acrylic acid CHEMBL519002
Type:
Small organic molecule
Emp. Form.:
C14H12N2O6
Mol. Mass.:
304.2549
SMILES:
OC(=O)\C=C\C(=O)Nc1cccc(NC(=O)\C=C\C(O)=O)c1
: