Target
72 kDa type IV collagenase
Ligand
BDBM23971
Substrate
Meas. Tech.
ChEMBL_556437 (CHEMBL955654)
IC50
21960±n/a nM
Citation
 Wang, QChen, MZhu, HZhang, JFang, HWang, BXu, W Design, synthesis, and QSAR studies of novel lysine derives as amino-peptidase N/CD13 inhibitors. Bioorg Med Chem 16:5473-81 (2008)  
Target
Name:
72 kDa type IV collagenase
Synonyms:
72 kDa gelatinase CLG4A Gelatinase A (MMP-2) MMP2_HUMAN Matrix metalloproteinase-2 (MMP 2) Matrix metalloproteinases 2 (MMP-2) | TBE-1
Type:
Enzyme
Mol. Mass.:
73870.36
Organism:
Homo sapiens (Human)
Description:
P08253
Residue:
660
  
Inhibitor
Name:
BDBM23971
Synonyms:
(2S)-2-[(2S,3R)-3-amino-2-hydroxy-4-phenylbutanamido]-4-methylpentanoic acid CHEMBL29292 | Ubenimex
Type:
Small organic molecule
Emp. Form.:
C16H24N2O4
Mol. Mass.:
308.3728
SMILES:
CC(C)C[C@H](NC(=O)[C@@H](O)[C@H](N)Cc1ccccc1)C(O)=O
: