Target
Beta-secretase 1
Ligand
BDBM50227345
Substrate
Meas. Tech.
ChEMBL_556474 (CHEMBL955691)
IC50
14±n/a nM
Citation
 Cumming, JNLe, TXBabu, SCarroll, CChen, XFavreau, LGaspari, PGuo, THobbs, DWHuang, YIserloh, UKennedy, MEKuvelkar, RLi, GLowrie, JMcHugh, NAOzgur, LPan, JParker, EMSaionz, KStamford, AWStrickland, CTadesse, DVoigt, JWang, LWu, YZhang, LZhang, Q Rational design of novel, potent piperazinone and imidazolidinone BACE1 inhibitors. Bioorg Med Chem Lett 18:3236-41 (2008)  
Target
Name:
Beta-secretase 1
Synonyms:
ASP2 Aspartyl protease 2 BACE1 Beta-secretase (BACE) Beta-secretase 1 (BACE 1) Beta-secretase 1 (BACE1) Beta-site amyloid precursor protein cleaving enzyme 1 Memapsin-2 beta-Secretase (BACE-1) | beta-Secretase (BACE1)
Type:
Protein
Mol. Mass.:
55755.10
Organism:
Homo sapiens (Human)
Description:
P56817
Residue:
501
  
Inhibitor
Name:
BDBM50227345
Synonyms:
CHEMBL255194 N1-((1R,2S)-1-((2R,4S)-4-benzylpiperidin-2-yl)-3-(3,5-difluorophenyl)-1-hydroxypropan-2-yl)-5-methyl-N3,N3-dipropylisophthalamide
Type:
Small organic molecule
Emp. Form.:
C36H45F2N3O3
Mol. Mass.:
605.7576
SMILES:
CCCN(CCC)C(=O)c1cc(C)cc(c1)C(=O)N[C@@H](Cc1cc(F)cc(F)c1)[C@H](O)[C@H]1C[C@@H](Cc2ccccc2)CCN1
: