Target
Nitric oxide synthase, brain
Ligand
BDBM50271515
Substrate
Meas. Tech.
ChEMBL_552452 (CHEMBL1002712)
Ki
75000±n/a nM
Citation
 Castaño, TEncinas, APérez, CCastro, ACampillo, NEGil, C Design, synthesis, and evaluation of potential inhibitors of nitric oxide synthase. Bioorg Med Chem 16:6193-206 (2008)  
Target
Name:
Nitric oxide synthase, brain
Synonyms:
Constitutive NOS NC-NOS NOS type I nNOS NOS1_HUMAN Neuronal nitric oxide synthase Nitric oxide synthase, neuronal (nNOS) bNOS | nNOS
Type:
Homodimer
Mol. Mass.:
160985.98
Organism:
Homo sapiens (Human)
Description:
P29475
Residue:
1434
  
Inhibitor
Name:
BDBM50271515
Synonyms:
1-(3-(4-(trifluoromethyl)phenoxy)propyl)-1H-imidazole | CHEMBL483706
Type:
Small organic molecule
Emp. Form.:
C13H13F3N2O
Mol. Mass.:
270.2503
SMILES:
FC(F)(F)c1ccc(OCCCn2ccnc2)cc1
: