Target
Sigma non-opioid intracellular receptor 1
Ligand
BDBM21398
Substrate
Meas. Tech.
ChEMBL_563916 (CHEMBL965019)
Ki
2.2±n/a nM
Citation
 Bedürftig, SWünsch, B 1,4-Diazepanes derived from (S)-serine--homopiperazines with improved sigma(1) (sigma) receptor affinity and selectivity. Eur J Med Chem 44:519-25 (2009)  
Target
Name:
Sigma non-opioid intracellular receptor 1
Synonyms:
OPRS1 SIGMAR1 Sigma non-opioid intracellular receptor 1 Sigma1-receptor Sterol isomerase-like protein
Type:
Protein
Mol. Mass.:
25307.17
Organism:
Cavia porcellus (Guinea pig)
Description:
Q60492
Residue:
223
  
Inhibitor
Name:
BDBM21398
Synonyms:
4-[4-(4-Chloro-phenyl)-4-hydroxy-piperidin-1-yl]-1-(4-fluoro-phenyl)-butan-1-one;propionate(HCl) CHEMBL54 Haloperidol | Haloperidol, 1
Type:
Small organic molecule
Emp. Form.:
C21H23ClFNO2
Mol. Mass.:
375.864
SMILES:
OC1(CCN(CCCC(=O)c2ccc(F)cc2)CC1)c1ccc(Cl)cc1
: