Target
Nitric oxide synthase, brain
Ligand
BDBM50209245
Substrate
Meas. Tech.
ChEMBL_552617 (CHEMBL957261)
IC50
25000±n/a nM
Citation
 Cottyn, BAcher, FRamassamy, BAlvey, LLepoivre, MFrapart, YStuehr, DMansuy, DBoucher, JLVichard, D Inhibitory effects of a series of 7-substituted-indazoles toward nitric oxide synthases: particular potency of 1H-indazole-7-carbonitrile. Bioorg Med Chem 16:5962-73 (2008)  
Target
Name:
Nitric oxide synthase, brain
Synonyms:
Bnos NC-NOS NOS type I nNOS Neuronal nitric oxide synthase Nitric Oxide Synthase, brain Nitric oxide synthase, brain (nNOS) Nitric-oxide synthase, brain (nNOS) Nos1 | Peptidyl-cysteine S-nitrosylase NOS1
Type:
Enzyme
Mol. Mass.:
160570.98
Organism:
Rattus norvegicus (rat)
Description:
Recombinant nNOS overexpressed in E. coli was used in enzyme assays.
Residue:
1429
  
Inhibitor
Name:
BDBM50209245
Synonyms:
CHEMBL247378
Type:
Small organic molecule
Emp. Form.:
C7H5N3O2
Mol. Mass.:
163.1335
SMILES:
[O-][N+](=O)c1cccc2cn[nH]c12
: