Target
5-hydroxytryptamine receptor 1B
Ligand
BDBM50054974
Substrate
Meas. Tech.
ChEMBL_552731 (CHEMBL965237)
Ki
0.100000±n/a nM
Citation
 Choi, SKGreen, DHo, AKlein, UMarquess, DTaylor, RTurner, SD Designing selective, high affinity ligands of 5-HT1D receptor by covalent dimerization of 5-HT1F ligands derived from 4-fluoro-N-[3-(1-methyl-4-piperidinyl)-1H-indol-5-yl]benzamide. J Med Chem 51:3609-16 (2008)  
Target
Name:
5-hydroxytryptamine receptor 1B
Synonyms:
5-HT-1B 5-HT1B 5HT1B_HUMAN HTR1DB Serotonin (5-HT) receptor Serotonin Receptor 1B
Type:
G Protein-Coupled Receptor (GPCR)
Mol. Mass.:
43579.17
Organism:
Homo sapiens (Human)
Description:
Receptor binding assays were performed using human clone stably expressed in CHO cells
Residue:
390
  
Inhibitor
Name:
BDBM50054974
Synonyms:
2-(5-((4-((3-(2-aminoethyl)-1H-indol-5-yloxy)methyl)phenyl)methoxy)-1H-indol-3-yl)ethanamine CHEMBL144030
Type:
Small organic molecule
Emp. Form.:
C28H30N4O2
Mol. Mass.:
454.5634
SMILES:
NCCc1c[nH]c2ccc(OCc3ccc(COc4ccc5[nH]cc(CCN)c5c4)cc3)cc12
: