Target
EEF1AKMT4-ECE2 readthrough transcript protein
Ligand
BDBM50271180
Substrate
Meas. Tech.
ChEMBL_552748 (CHEMBL965254)
IC50
32900±n/a nM
Citation
 Gagnidze, KSachchidanand, naRozenfeld, RMezei, MZhou, MMDevi, LA Homology modeling and site-directed mutagenesis to identify selective inhibitors of endothelin-converting enzyme-2. J Med Chem 51:3378-87 (2008)  
Target
Name:
EEF1AKMT4-ECE2 readthrough transcript protein
Synonyms:
EEF1AKMT4-ECE2 Endothelin-converting enzyme 2 Endothelin-converting enzyme 2 (ECE2) | Endothelin-converting enzyme 2 region
Type:
Enzyme
Mol. Mass.:
99745.05
Organism:
Homo sapiens (Human)
Description:
P0DPD8
Residue:
883
  
Inhibitor
Name:
BDBM50271180
Synonyms:
2-(2-hydroxy-3-methoxystyryl)quinolin-8-ol | CHEMBL488139
Type:
Small organic molecule
Emp. Form.:
C18H15NO3
Mol. Mass.:
293.3166
SMILES:
COc1cccc(\C=C\c2ccc3cccc(O)c3n2)c1O
: