Target
5-hydroxytryptamine receptor 1D
Ligand
BDBM50243699
Substrate
Meas. Tech.
ChEMBL_554187 (CHEMBL963644)
Ki
0.55±n/a nM
Citation
 Pelletier, JCChengalvala, MCottom, JFeingold, IGarrick, LGreen, DHauze, DHuselton, CJetter, JKao, WKopf, GSLundquist, JTMann, CMehlmann, JRogers, JShanno, LWrobel, J 2-phenyl-4-piperazinylbenzimidazoles: orally active inhibitors of the gonadotropin releasing hormone (GnRH) receptor. Bioorg Med Chem 16:6617-40 (2008)  
Target
Name:
5-hydroxytryptamine receptor 1D
Synonyms:
5-HT-1D 5-HT1D 5HT1D_HUMAN HTR1DA Serotonin (5-HT) receptor | Serotonin Receptor 1D
Type:
G Protein-Coupled Receptor (GPCR)
Mol. Mass.:
41920.63
Organism:
Homo sapiens (Human)
Description:
Receptor binding assays were performed using human clone stably expressed in CHO cells.
Residue:
377
  
Inhibitor
Name:
BDBM50243699
Synonyms:
2-(trifluoromethyl)-7-(2-(4-(2-(trifluoromethyl)-1H-benzo[d]imidazol-4-yl)piperazin-1-yl)ethoxy)-1H-benzo[d]imidazole | CHEMBL472117
Type:
Small organic molecule
Emp. Form.:
C22H20F6N6O
Mol. Mass.:
498.4242
SMILES:
FC(F)(F)c1nc2cccc(OCCN3CCN(CC3)c3cccc4[nH]c(nc34)C(F)(F)F)c2[nH]1
: