Target
Gonadotropin-releasing hormone receptor
Ligand
BDBM50244176
Substrate
Meas. Tech.
ChEMBL_554185 (CHEMBL963642)
IC50
480±n/a nM
Citation
 Pelletier, JCChengalvala, MCottom, JFeingold, IGarrick, LGreen, DHauze, DHuselton, CJetter, JKao, WKopf, GSLundquist, JTMann, CMehlmann, JRogers, JShanno, LWrobel, J 2-phenyl-4-piperazinylbenzimidazoles: orally active inhibitors of the gonadotropin releasing hormone (GnRH) receptor. Bioorg Med Chem 16:6617-40 (2008)  
Target
Name:
Gonadotropin-releasing hormone receptor
Synonyms:
GNRHR_RAT GnRH-R | Gnrhr
Type:
PROTEIN
Mol. Mass.:
37767.60
Organism:
Rattus norvegicus
Description:
ChEMBL_1335047
Residue:
327
  
Inhibitor
Name:
BDBM50244176
Synonyms:
5-({4-[2-(4-tert-Butylphenyl)-1H-benzimidazol-4-yl]piperazin-1-yl}methyl)-1,4-dihydroquinoxaline-2,3-dione | CHEMBL517881
Type:
Small organic molecule
Emp. Form.:
C30H32N6O2
Mol. Mass.:
508.6141
SMILES:
CC(C)(C)c1ccc(cc1)-c1nc2c(cccc2[nH]1)N1CCN(Cc2cccc3[nH]c(=O)c(=O)[nH]c23)CC1
: