Target
Cannabinoid receptor 2
Ligand
BDBM50244009
Substrate
Meas. Tech.
ChEMBL_554819 (CHEMBL953972)
Ki
53±n/a nM
Citation
 Pagé, DBalaux, EBoisvert, LLiu, ZMilburn, CTremblay, MWei, ZWoo, SLuo, XCheng, YXYang, HSrivastava, SZhou, FBrown, WTomaszewski, MWalpole, CHodzic, LSt-Onge, SGodbout, CSalois, DPayza, KPayza, K Novel benzimidazole derivatives as selective CB2 agonists. Bioorg Med Chem Lett 18:3695-700 (2008)  
Target
Name:
Cannabinoid receptor 2
Synonyms:
CANNABINOID CB2 CB2 CB2B CNR2_HUMAN Cannabinoid CB2 receptor Cannabinoid receptor 2 (CB2R) | hCB2
Type:
G Protein-Coupled Receptor (GPCR)
Mol. Mass.:
39690.94
Organism:
Homo sapiens (Human)
Description:
P34972
Residue:
360
  
Inhibitor
Name:
BDBM50244009
Synonyms:
2-(4-(cyclopropylmethoxy)benzyl)-N,N-diethyl-1-isopentyl-1H-benzo[d]imidazole-5-carboxamide | CHEMBL511021
Type:
Small organic molecule
Emp. Form.:
C28H37N3O2
Mol. Mass.:
447.6123
SMILES:
CCN(CC)C(=O)c1ccc2n(CCC(C)C)c(Cc3ccc(OCC4CC4)cc3)nc2c1
: