Target
Cannabinoid receptor 2
Ligand
BDBM50243706
Substrate
Meas. Tech.
ChEMBL_554819 (CHEMBL953972)
Ki
3.9±n/a nM
Citation
 Pagé, DBalaux, EBoisvert, LLiu, ZMilburn, CTremblay, MWei, ZWoo, SLuo, XCheng, YXYang, HSrivastava, SZhou, FBrown, WTomaszewski, MWalpole, CHodzic, LSt-Onge, SGodbout, CSalois, DPayza, KPayza, K Novel benzimidazole derivatives as selective CB2 agonists. Bioorg Med Chem Lett 18:3695-700 (2008)  
Target
Name:
Cannabinoid receptor 2
Synonyms:
CANNABINOID CB2 CB2 CB2B CNR2_HUMAN Cannabinoid CB2 receptor Cannabinoid receptor 2 (CB2R) | hCB2
Type:
G Protein-Coupled Receptor (GPCR)
Mol. Mass.:
39690.94
Organism:
Homo sapiens (Human)
Description:
P34972
Residue:
360
  
Inhibitor
Name:
BDBM50243706
Synonyms:
2-(4-ethoxybenzyl)-N,N-diethyl-1-((tetrahydro-2H-pyran-4-yl)methyl)-1H-benzo[d]imidazole-5-carboxamide | CHEMBL471374
Type:
Small organic molecule
Emp. Form.:
C27H35N3O3
Mol. Mass.:
449.5851
SMILES:
CCOc1ccc(Cc2nc3cc(ccc3n2CC2CCOCC2)C(=O)N(CC)CC)cc1
: