Target
Cannabinoid receptor 1
Ligand
BDBM50244180
Substrate
Meas. Tech.
ChEMBL_554820 (CHEMBL953973)
Ki
>5000±n/a nM
Citation
 Pagé, DBalaux, EBoisvert, LLiu, ZMilburn, CTremblay, MWei, ZWoo, SLuo, XCheng, YXYang, HSrivastava, SZhou, FBrown, WTomaszewski, MWalpole, CHodzic, LSt-Onge, SGodbout, CSalois, DPayza, KPayza, K Novel benzimidazole derivatives as selective CB2 agonists. Bioorg Med Chem Lett 18:3695-700 (2008)  
Target
Name:
Cannabinoid receptor 1
Synonyms:
CANN6 CB-R CNR CNR1_HUMAN Cannabinoid receptor Cannabinoid receptor 1 (brain)
Type:
G Protein-Coupled Receptor (GPCR)
Mol. Mass.:
52868.96
Organism:
Homo sapiens (Human)
Description:
P21554
Residue:
472
  
Inhibitor
Name:
BDBM50244180
Synonyms:
1-(2-(4-ethoxybenzyl)-1-(cyclopropylmethyl)-1H-benzo[d]imidazol-5-yl)-3,3-diethyl-1-methylurea | CHEMBL462330
Type:
Small organic molecule
Emp. Form.:
C26H34N4O2
Mol. Mass.:
434.5738
SMILES:
CCOc1ccc(Cc2nc3cc(ccc3n2CC2CC2)N(C)C(=O)N(CC)CC)cc1
: