Target
Cannabinoid receptor 1
Ligand
BDBM50244057
Substrate
Meas. Tech.
ChEMBL_554820 (CHEMBL953973)
Ki
>5000±n/a nM
Citation
 Pagé, DBalaux, EBoisvert, LLiu, ZMilburn, CTremblay, MWei, ZWoo, SLuo, XCheng, YXYang, HSrivastava, SZhou, FBrown, WTomaszewski, MWalpole, CHodzic, LSt-Onge, SGodbout, CSalois, DPayza, KPayza, K Novel benzimidazole derivatives as selective CB2 agonists. Bioorg Med Chem Lett 18:3695-700 (2008)  
Target
Name:
Cannabinoid receptor 1
Synonyms:
CANN6 CB-R CNR CNR1_HUMAN Cannabinoid receptor Cannabinoid receptor 1 (brain)
Type:
G Protein-Coupled Receptor (GPCR)
Mol. Mass.:
52868.96
Organism:
Homo sapiens (Human)
Description:
P21554
Residue:
472
  
Inhibitor
Name:
BDBM50244057
Synonyms:
2-(4-ethoxybenzyl)-1-(cyclopropylmethyl)-N-ethyl-1H-benzo[d]imidazole-5-carboxamide | CHEMBL454096
Type:
Small organic molecule
Emp. Form.:
C23H27N3O2
Mol. Mass.:
377.4794
SMILES:
CCNC(=O)c1ccc2n(CC3CC3)c(Cc3ccc(OCC)cc3)nc2c1
: