Target
Cannabinoid receptor 1
Ligand
BDBM50243962
Substrate
Meas. Tech.
ChEMBL_554820 (CHEMBL953973)
Ki
>5000±n/a nM
Citation
 Pagé, DBalaux, EBoisvert, LLiu, ZMilburn, CTremblay, MWei, ZWoo, SLuo, XCheng, YXYang, HSrivastava, SZhou, FBrown, WTomaszewski, MWalpole, CHodzic, LSt-Onge, SGodbout, CSalois, DPayza, KPayza, K Novel benzimidazole derivatives as selective CB2 agonists. Bioorg Med Chem Lett 18:3695-700 (2008)  
Target
Name:
Cannabinoid receptor 1
Synonyms:
CANN6 CB-R CNR CNR1_HUMAN Cannabinoid receptor Cannabinoid receptor 1 (brain)
Type:
G Protein-Coupled Receptor (GPCR)
Mol. Mass.:
52868.96
Organism:
Homo sapiens (Human)
Description:
P21554
Residue:
472
  
Inhibitor
Name:
BDBM50243962
Synonyms:
2-(4-cyclobutoxybenzyl)-N,N-diethyl-1-isopentyl-1H-benzo[d]imidazole-5-carboxamide | CHEMBL453847
Type:
Small organic molecule
Emp. Form.:
C28H37N3O2
Mol. Mass.:
447.6123
SMILES:
CCN(CC)C(=O)c1ccc2n(CCC(C)C)c(Cc3ccc(OC4CCC4)cc3)nc2c1
: