Target
Cannabinoid receptor 1
Ligand
BDBM50243911
Substrate
Meas. Tech.
ChEMBL_554820 (CHEMBL953973)
Ki
>5000±n/a nM
Citation
 Pagé, DBalaux, EBoisvert, LLiu, ZMilburn, CTremblay, MWei, ZWoo, SLuo, XCheng, YXYang, HSrivastava, SZhou, FBrown, WTomaszewski, MWalpole, CHodzic, LSt-Onge, SGodbout, CSalois, DPayza, KPayza, K Novel benzimidazole derivatives as selective CB2 agonists. Bioorg Med Chem Lett 18:3695-700 (2008)  
Target
Name:
Cannabinoid receptor 1
Synonyms:
CANN6 CB-R CNR CNR1_HUMAN Cannabinoid receptor Cannabinoid receptor 1 (brain)
Type:
G Protein-Coupled Receptor (GPCR)
Mol. Mass.:
52868.96
Organism:
Homo sapiens (Human)
Description:
P21554
Residue:
472
  
Inhibitor
Name:
BDBM50243911
Synonyms:
2-((4-ethoxyphenyl)(hydroxy)methyl)-N,N-diethyl-1-isopentyl-1H-benzo[d]imidazole-5-carboxamide | CHEMBL488816
Type:
Small organic molecule
Emp. Form.:
C26H35N3O3
Mol. Mass.:
437.5744
SMILES:
CCOc1ccc(cc1)C(O)c1nc2cc(ccc2n1CCC(C)C)C(=O)N(CC)CC
: