Target
Cannabinoid receptor 1
Ligand
BDBM50244317
Substrate
Meas. Tech.
ChEMBL_554820 (CHEMBL953973)
Ki
491±n/a nM
Citation
 Pagé, DBalaux, EBoisvert, LLiu, ZMilburn, CTremblay, MWei, ZWoo, SLuo, XCheng, YXYang, HSrivastava, SZhou, FBrown, WTomaszewski, MWalpole, CHodzic, LSt-Onge, SGodbout, CSalois, DPayza, KPayza, K Novel benzimidazole derivatives as selective CB2 agonists. Bioorg Med Chem Lett 18:3695-700 (2008)  
Target
Name:
Cannabinoid receptor 1
Synonyms:
CANN6 CB-R CNR CNR1_HUMAN Cannabinoid receptor Cannabinoid receptor 1 (brain)
Type:
G Protein-Coupled Receptor (GPCR)
Mol. Mass.:
52868.96
Organism:
Homo sapiens (Human)
Description:
P21554
Residue:
472
  
Inhibitor
Name:
BDBM50244317
Synonyms:
2-(4-ethoxybenzyl)-1-(cyclopentylmethyl)-N,N-diethyl-1H-benzo[d]imidazole-5-carboxamide | CHEMBL471129
Type:
Small organic molecule
Emp. Form.:
C27H35N3O2
Mol. Mass.:
433.5857
SMILES:
CCOc1ccc(Cc2nc3cc(ccc3n2CC2CCCC2)C(=O)N(CC)CC)cc1
: