Target
Cannabinoid receptor 2
Ligand
BDBM50244178
Substrate
Meas. Tech.
ChEMBL_554821 (CHEMBL953974)
EC50
2.6±n/a nM
Citation
 Pagé, DBalaux, EBoisvert, LLiu, ZMilburn, CTremblay, MWei, ZWoo, SLuo, XCheng, YXYang, HSrivastava, SZhou, FBrown, WTomaszewski, MWalpole, CHodzic, LSt-Onge, SGodbout, CSalois, DPayza, KPayza, K Novel benzimidazole derivatives as selective CB2 agonists. Bioorg Med Chem Lett 18:3695-700 (2008)  
Target
Name:
Cannabinoid receptor 2
Synonyms:
CANNABINOID CB2 CB2 CB2B CNR2_HUMAN Cannabinoid CB2 receptor Cannabinoid receptor 2 (CB2R) | hCB2
Type:
G Protein-Coupled Receptor (GPCR)
Mol. Mass.:
39690.94
Organism:
Homo sapiens (Human)
Description:
P34972
Residue:
360
  
Inhibitor
Name:
BDBM50244178
Synonyms:
CHEMBL518206 | N-(2-(4-ethoxybenzyl)-1-(cyclopropylmethyl)-1H-benzo[d]imidazol-5-yl)-N-methylthiophene-2-carboxamide
Type:
Small organic molecule
Emp. Form.:
C26H27N3O2S
Mol. Mass.:
445.576
SMILES:
CCOc1ccc(Cc2nc3cc(ccc3n2CC2CC2)N(C)C(=O)c2cccs2)cc1
: