Target
Cannabinoid receptor 2
Ligand
BDBM50244059
Substrate
Meas. Tech.
ChEMBL_554821 (CHEMBL953974)
EC50
3.2±n/a nM
Citation
 Pagé, DBalaux, EBoisvert, LLiu, ZMilburn, CTremblay, MWei, ZWoo, SLuo, XCheng, YXYang, HSrivastava, SZhou, FBrown, WTomaszewski, MWalpole, CHodzic, LSt-Onge, SGodbout, CSalois, DPayza, KPayza, K Novel benzimidazole derivatives as selective CB2 agonists. Bioorg Med Chem Lett 18:3695-700 (2008)  
Target
Name:
Cannabinoid receptor 2
Synonyms:
CANNABINOID CB2 CB2 CB2B CNR2_HUMAN Cannabinoid CB2 receptor Cannabinoid receptor 2 (CB2R) | hCB2
Type:
G Protein-Coupled Receptor (GPCR)
Mol. Mass.:
39690.94
Organism:
Homo sapiens (Human)
Description:
P34972
Residue:
360
  
Inhibitor
Name:
BDBM50244059
Synonyms:
2-(4-ethoxybenzyl)-1-(cyclopropylmethyl)-N-methyl-N-propyl-1H-benzo[d]imidazole-5-carboxamide | CHEMBL454607
Type:
Small organic molecule
Emp. Form.:
C25H31N3O2
Mol. Mass.:
405.5325
SMILES:
CCCN(C)C(=O)c1ccc2n(CC3CC3)c(Cc3ccc(OCC)cc3)nc2c1
: