Target
Cannabinoid receptor 2
Ligand
BDBM50244180
Substrate
Meas. Tech.
ChEMBL_554819 (CHEMBL953972)
Ki
5.9±n/a nM
Citation
 Pagé, DBalaux, EBoisvert, LLiu, ZMilburn, CTremblay, MWei, ZWoo, SLuo, XCheng, YXYang, HSrivastava, SZhou, FBrown, WTomaszewski, MWalpole, CHodzic, LSt-Onge, SGodbout, CSalois, DPayza, KPayza, K Novel benzimidazole derivatives as selective CB2 agonists. Bioorg Med Chem Lett 18:3695-700 (2008)  
Target
Name:
Cannabinoid receptor 2
Synonyms:
CANNABINOID CB2 CB2 CB2B CNR2_HUMAN Cannabinoid CB2 receptor Cannabinoid receptor 2 (CB2R) | hCB2
Type:
G Protein-Coupled Receptor (GPCR)
Mol. Mass.:
39690.94
Organism:
Homo sapiens (Human)
Description:
P34972
Residue:
360
  
Inhibitor
Name:
BDBM50244180
Synonyms:
1-(2-(4-ethoxybenzyl)-1-(cyclopropylmethyl)-1H-benzo[d]imidazol-5-yl)-3,3-diethyl-1-methylurea | CHEMBL462330
Type:
Small organic molecule
Emp. Form.:
C26H34N4O2
Mol. Mass.:
434.5738
SMILES:
CCOc1ccc(Cc2nc3cc(ccc3n2CC2CC2)N(C)C(=O)N(CC)CC)cc1
: