Target
Mitogen-activated protein kinase kinase kinase 5
Ligand
BDBM50243867
Substrate
Meas. Tech.
ChEMBL_555220 (CHEMBL965357)
Kd
8000±n/a nM
Citation
 Kawaguchi, MTerai, TUtata, RKato, MTsuganezawa, KTanaka, AKojima, HOkabe, TNagano, T Development of a novel fluorescent probe for fluorescence correlation spectroscopic detection of kinase inhibitors. Bioorg Med Chem Lett 18:3752-5 (2008)  
Target
Name:
Mitogen-activated protein kinase kinase kinase 5
Synonyms:
ASK1 MAP3K5 MEKK5
Type:
Protein
Mol. Mass.:
154514.93
Organism:
Homo sapiens (Human)
Description:
Q99683
Residue:
1374
  
Inhibitor
Name:
BDBM50243867
Synonyms:
CHEMBL478889 | STS-PEG-TAMRA
Type:
Small organic molecule
Emp. Form.:
C59H58N7O10
Mol. Mass.:
1025.1322
SMILES:
CO[C@@H]1[C@@H](C[C@H]2O[C@]1(C)n1c3ccccc3c3c4CNC(=O)c4c4c5ccccc5n2c4c13)N(C)C(=O)COCCOCCNC(=O)c1ccc(c(c1)C(O)=O)-c1c2ccc(cc2oc2cc(ccc12)=[N+](C)C)N(C)C
: