Target
Aurora kinase A
Ligand
BDBM50243979
Substrate
Meas. Tech.
ChEMBL_554991 (CHEMBL962087)
IC50
47000±n/a nM
Citation
 Peifer, CSelig, RKinkel, KOtt, DTotzke, FSchächtele, CHeidenreich, RRöcken, MSchollmeyer, DLaufer, S Design, synthesis, and biological evaluation of novel 3-aryl-4-(1H-indole-3yl)-1,5-dihydro-2H-pyrrole-2-ones as vascular endothelial growth factor receptor (VEGF-R) inhibitors. J Med Chem 51:3814-24 (2008)  
Target
Name:
Aurora kinase A
Synonyms:
AIK ARK1 AURKA AYK1 Aurora kinase A (AURA) Aurora kinase A (Aurora A) Aurora-related kinase 1 BTAK Breast-tumor-amplified kinase STK15 Serine/threonine kinase 15 Serine/threonine-protein kinase aurora A hARK1
Type:
Serine/threonine-protein kinase
Mol. Mass.:
45830.98
Organism:
Homo sapiens (Human)
Description:
O14965
Residue:
403
  
Inhibitor
Name:
BDBM50243979
Synonyms:
4-[1-(2,3-Dihydroxypropyl)-1H-indol-3-yl]-3-(3,4,5-trimethoxyphenyl)-1,5-dihydro-2H-pyrrole-2-one | CHEMBL453593
Type:
Small organic molecule
Emp. Form.:
C24H26N2O6
Mol. Mass.:
438.473
SMILES:
COc1cc(cc(OC)c1OC)C1=C(CNC1=O)c1cn(CC(O)CO)c2ccccc12
: