Target
Ephrin type-B receptor 4
Ligand
BDBM50243930
Substrate
Meas. Tech.
ChEMBL_554998 (CHEMBL957973)
IC50
20000±n/a nM
Citation
 Peifer, CSelig, RKinkel, KOtt, DTotzke, FSchächtele, CHeidenreich, RRöcken, MSchollmeyer, DLaufer, S Design, synthesis, and biological evaluation of novel 3-aryl-4-(1H-indole-3yl)-1,5-dihydro-2H-pyrrole-2-ones as vascular endothelial growth factor receptor (VEGF-R) inhibitors. J Med Chem 51:3814-24 (2008)  
Target
Name:
Ephrin type-B receptor 4
Synonyms:
EPHB4 Ephrin receptor HTK MYK1 Tyrosine-protein kinase TYRO11 | VHL/Ephrin type-B receptor 4
Type:
Enzyme
Mol. Mass.:
108273.51
Organism:
Homo sapiens (Human)
Description:
P54760
Residue:
987
  
Inhibitor
Name:
BDBM50243930
Synonyms:
4-[1-(tert-Butoxymethyl)-1H-indol-3-yl]-3-(3,4,5-trimethoxyphenyl)-1,5-dihydro-2H-pyrrole-2-one | CHEMBL488646
Type:
Small organic molecule
Emp. Form.:
C26H30N2O5
Mol. Mass.:
450.5268
SMILES:
COc1cc(cc(OC)c1OC)C1=C(CNC1=O)c1cn(COC(C)(C)C)c2ccccc12
: