Target
Proto-oncogene tyrosine-protein kinase Src
Ligand
BDBM50243761
Substrate
Meas. Tech.
ChEMBL_555001 (CHEMBL957976)
IC50
14000±n/a nM
Citation
 Peifer, CSelig, RKinkel, KOtt, DTotzke, FSchächtele, CHeidenreich, RRöcken, MSchollmeyer, DLaufer, S Design, synthesis, and biological evaluation of novel 3-aryl-4-(1H-indole-3yl)-1,5-dihydro-2H-pyrrole-2-ones as vascular endothelial growth factor receptor (VEGF-R) inhibitors. J Med Chem 51:3814-24 (2008)  
Target
Name:
Proto-oncogene tyrosine-protein kinase Src
Synonyms:
Calmodulin/Proto-oncogene tyrosine-protein kinase Src Proto-oncogene c-Src SRC SRC_HUMAN V-src sarcoma (Schmidt-Ruppin A-2) viral oncogene homolog (avian) p60-Src | pp60c-src
Type:
Protein
Mol. Mass.:
59838.60
Organism:
Homo sapiens (Human)
Description:
P12931
Residue:
536
  
Inhibitor
Name:
BDBM50243761
Synonyms:
4-(1H-Indol-3-yl)-3-(3,4,5-trimethoxyphenyl)-1,5-dihydro-2H-pyrrole-2-one | CHEMBL529663
Type:
Small organic molecule
Emp. Form.:
C21H20N2O4
Mol. Mass.:
364.3945
SMILES:
COc1cc(cc(OC)c1OC)C1=C(CNC1=O)c1c[nH]c2ccccc12
: