Target
Mitogen-activated protein kinase kinase kinase 8
Ligand
BDBM50243761
Substrate
Meas. Tech.
ChEMBL_555010 (CHEMBL957985)
IC50
32000±n/a nM
Citation
 Peifer, CSelig, RKinkel, KOtt, DTotzke, FSchächtele, CHeidenreich, RRöcken, MSchollmeyer, DLaufer, S Design, synthesis, and biological evaluation of novel 3-aryl-4-(1H-indole-3yl)-1,5-dihydro-2H-pyrrole-2-ones as vascular endothelial growth factor receptor (VEGF-R) inhibitors. J Med Chem 51:3814-24 (2008)  
Target
Name:
Mitogen-activated protein kinase kinase kinase 8
Synonyms:
C-COT COT proto-oncogene serine/threonine-protein kinase ESTF MAP3K8 Tumor Progression Loci-2 Kinase (COT) | Tumor progression locus 2
Type:
Serine/threonine-protein kinase
Mol. Mass.:
52916.89
Organism:
Homo sapiens (Human)
Description:
P41279
Residue:
467
  
Inhibitor
Name:
BDBM50243761
Synonyms:
4-(1H-Indol-3-yl)-3-(3,4,5-trimethoxyphenyl)-1,5-dihydro-2H-pyrrole-2-one | CHEMBL529663
Type:
Small organic molecule
Emp. Form.:
C21H20N2O4
Mol. Mass.:
364.3945
SMILES:
COc1cc(cc(OC)c1OC)C1=C(CNC1=O)c1c[nH]c2ccccc12
: