Target
Hepatocyte growth factor receptor
Ligand
BDBM50243930
Substrate
Meas. Tech.
ChEMBL_555006 (CHEMBL957981)
IC50
29000±n/a nM
Citation
 Peifer, CSelig, RKinkel, KOtt, DTotzke, FSchächtele, CHeidenreich, RRöcken, MSchollmeyer, DLaufer, S Design, synthesis, and biological evaluation of novel 3-aryl-4-(1H-indole-3yl)-1,5-dihydro-2H-pyrrole-2-ones as vascular endothelial growth factor receptor (VEGF-R) inhibitors. J Med Chem 51:3814-24 (2008)  
Target
Name:
Hepatocyte growth factor receptor
Synonyms:
Hepatocyte growth factor receptor Hepatocyte growth factor receptor (c-MET) MET Met proto-oncogene (hepatocyte growth factor receptor) Tyrosine-protein kinase Met (c-Met) c-Met kinase
Type:
Protein
Mol. Mass.:
155559.73
Organism:
Homo sapiens (Human)
Description:
P08581
Residue:
1390
  
Inhibitor
Name:
BDBM50243930
Synonyms:
4-[1-(tert-Butoxymethyl)-1H-indol-3-yl]-3-(3,4,5-trimethoxyphenyl)-1,5-dihydro-2H-pyrrole-2-one | CHEMBL488646
Type:
Small organic molecule
Emp. Form.:
C26H30N2O5
Mol. Mass.:
450.5268
SMILES:
COc1cc(cc(OC)c1OC)C1=C(CNC1=O)c1cn(COC(C)(C)C)c2ccccc12
: