Target
Nociceptin receptor
Ligand
BDBM50244371
Substrate
Meas. Tech.
ChEMBL_491434 (CHEMBL948529)
IC50
27±n/a nM
Citation
 Yoshizumi, TTakahashi, HMiyazoe, HSugimoto, YTsujita, TKato, TIto, HKawamoto, HHirayama, MIchikawa, DAzuma-Kanoh, TOzaki, SShibata, YTani, TChiba, MIshii, YOkuda, STadano, KFukuroda, TOkamoto, OOhta, H A novel class of cycloalkano[b]pyridines as potent and orally active opioid receptor-like 1 antagonists with minimal binding affinity to the hERG K+ channel. J Med Chem 51:4021-9 (2008)  
Target
Name:
Nociceptin receptor
Synonyms:
KOR-3 Mu-type opioid receptor (Mu) Nociceptin Receptor (ORL1 Receptor) Nociceptin receptor (ORL-1) Nociceptin/Orphanin FQ, NOP receptor OPIATE ORL-1 OPRL1 protein ORL1 Opioid receptor like-1 Orphanin FQ receptor (ORL1) | P41146
Type:
G Protein-Coupled Receptor (GPCR)
Mol. Mass.:
40702.87
Organism:
Homo sapiens (Human)
Description:
P41146
Residue:
370
  
Inhibitor
Name:
BDBM50244371
Synonyms:
(7R,9S)-7-((4-(2-chlorophenyl)piperidin-1-yl)methyl)-6,7,8,9-tetrahydro-5H-cyclohepta[b]pyridin-9-ol | CHEMBL487485
Type:
Small organic molecule
Emp. Form.:
C22H27ClN2O
Mol. Mass.:
370.916
SMILES:
O[C@H]1C[C@H](CN2CCC(CC2)c2ccccc2Cl)CCc2cccnc12
: