Target
C-C chemokine receptor type 5
Ligand
BDBM50141860
Substrate
Meas. Tech.
ChEMBL_500129 (CHEMBL974332)
IC50
4.6±n/a nM
Citation
 Zhuo, YKong, RCong, XJChen, WZWang, CX Three-dimensional QSAR analyses of 1,3,4-trisubstituted pyrrolidine-based CCR5 receptor inhibitors. Eur J Med Chem 43:2724-34 (2008)  
Target
Name:
C-C chemokine receptor type 5
Synonyms:
C-C CKR-5 CC-CKR-5 CCR5 CCR5_HUMAN CHEMR13 HIV-1 fusion coreceptor
Type:
Enzyme
Mol. Mass.:
40540.21
Organism:
Homo sapiens (Human)
Description:
P51681
Residue:
352
  
Inhibitor
Name:
BDBM50141860
Synonyms:
(R)-2-((3S,4S)-3-((4-(3-benzyl-1-propyl-1H-pyrazol-5-yl)piperidin-1-yl)methyl)-4-phenylpyrrolidin-1-yl)-2-cyclohexylacetic acid {3-[4-(5-Benzyl-2-propyl-2H-pyrazol-3-yl)-piperidin-1-ylmethyl]-4-phenyl-pyrrolidin-1-yl}-cyclohexyl-acetic acid
Type:
Small organic molecule
Emp. Form.:
C37H50N4O2
Mol. Mass.:
582.8185
SMILES:
CCCn1nc(Cc2ccccc2)cc1C1CCN(C[C@H]2CN(C[C@@H]2c2ccccc2)[C@H](C2CCCCC2)C(O)=O)CC1
: