Target
Gastric inhibitory polypeptide
Ligand
BDBM50244266
Substrate
Meas. Tech.
ChEMBL_491828 (CHEMBL945218)
IC50
>1000±n/a nM
Citation
 Kim, RMChang, JLins, ARBrady, ECandelore, MRDallas-Yang, QDing, VDragovic, JIliff, SJiang, GMock, SQureshi, SSaperstein, RSzalkowski, DTamvakopoulos, CTota, LWright, MYang, XTata, JRChapman, KZhang, BBParmee, ER Discovery of potent, orally active benzimidazole glucagon receptor antagonists. Bioorg Med Chem Lett 18:3701-5 (2008)  
Target
Name:
Gastric inhibitory polypeptide
Synonyms:
GIP | GIP_HUMAN
Type:
PROTEIN
Mol. Mass.:
17110.38
Organism:
Homo sapiens (Human)
Description:
ChEMBL_491828
Residue:
153
  
Inhibitor
Name:
BDBM50244266
Synonyms:
CHEMBL472154 | trans-4-(((4-tert-butylcyclohexyl)(5-fluoro-1-methyl-1H-benzo[d]imidazol-2-yl)amino)methyl)-N-(1H-tetrazol-5-yl)benzamide
Type:
Small organic molecule
Emp. Form.:
C27H33FN8O
Mol. Mass.:
504.6023
SMILES:
Cn1c(nc2cc(F)ccc12)N(Cc1ccc(cc1)C(=O)Nc1nnn[nH]1)[C@H]1CC[C@@H](CC1)C(C)(C)C
: