Target
RAC-alpha serine/threonine-protein kinase
Ligand
BDBM50243782
Substrate
Meas. Tech.
ChEMBL_492201 (CHEMBL951577)
IC50
9±n/a nM
Citation
 Siu, TLiang, JArruda, JLi, YJones, REDefeo-Jones, DBarnett, SFRobinson, RG Discovery of potent and cell-active allosteric dual Akt 1 and 2 inhibitors. Bioorg Med Chem Lett 18:4186-90 (2008)  
Target
Name:
RAC-alpha serine/threonine-protein kinase
Synonyms:
AKT phosphorylation (p-AKT) AKT1/PPP1CA C-AKT PKB alpha Protein kinase B Protein kinase B (Akt 1) Protein kinase B alpha Proto-oncogene Akt (Akt1) Proto-oncogene c-Akt (AKT1) RAC-PK-alpha RAC-alpha serine/threonine-protein kinase (AKT1) | RAC-alpha serine/threonine-protein kinase (pAKT)
Type:
Enzyme
Mol. Mass.:
55681.25
Organism:
Homo sapiens (Human)
Description:
P31749
Residue:
480
  
Inhibitor
Name:
BDBM50243782
Synonyms:
2-(4-(6-phenyl-7-(4-((4-(5-(pyridin-2-yl)-4H-1,2,4-triazol-3-yl)piperidin-1-yl)methyl)phenyl)pyrido[2,3-d]pyrimidin-2-yl)piperazin-1-yl)ethanol | CHEMBL453995
Type:
Small organic molecule
Emp. Form.:
C38H40N10O
Mol. Mass.:
652.7906
SMILES:
OCCN1CCN(CC1)c1ncc2cc(-c3ccccc3)c(nc2n1)-c1ccc(CN2CCC(CC2)c2nnc([nH]2)-c2ccccn2)cc1
: