Target
RAC-beta serine/threonine-protein kinase
Ligand
BDBM50243784
Substrate
Meas. Tech.
ChEMBL_492202 (CHEMBL951578)
IC50
539±n/a nM
Citation
 Siu, TLiang, JArruda, JLi, YJones, REDefeo-Jones, DBarnett, SFRobinson, RG Discovery of potent and cell-active allosteric dual Akt 1 and 2 inhibitors. Bioorg Med Chem Lett 18:4186-90 (2008)  
Target
Name:
RAC-beta serine/threonine-protein kinase
Synonyms:
AKT2 PKB beta Protein kinase B (Akt 2) Protein kinase B, beta RAC-alpha serine/threonine-protein kinase (AKT2) RAC-beta serine/threonine-protein kinase (AKT2) Serine/threonine-protein kinase AKT2 | Serine/threonine-protein kinase Rac alpha/beta
Type:
Enzyme
Mol. Mass.:
55766.64
Organism:
Homo sapiens (Human)
Description:
Residue:
481
  
Inhibitor
Name:
BDBM50243784
Synonyms:
5-(4-methylpiperazin-1-yl)-3-phenyl-2-(4-((4-(5-(pyridin-2-yl)-4H-1,2,4-triazol-3-yl)piperidin-1-yl)methyl)phenyl)-1,6-naphthyridine | CHEMBL506434
Type:
Small organic molecule
Emp. Form.:
C38H39N9
Mol. Mass.:
621.7766
SMILES:
CN1CCN(CC1)c1nccc2nc(-c3ccc(CN4CCC(CC4)c4nnc([nH]4)-c4ccccn4)cc3)c(cc12)-c1ccccc1
: