Target
RAC-beta serine/threonine-protein kinase
Ligand
BDBM50243775
Substrate
Meas. Tech.
ChEMBL_492204 (CHEMBL951580)
IC50
70±n/a nM
Citation
 Siu, TLiang, JArruda, JLi, YJones, REDefeo-Jones, DBarnett, SFRobinson, RG Discovery of potent and cell-active allosteric dual Akt 1 and 2 inhibitors. Bioorg Med Chem Lett 18:4186-90 (2008)  
Target
Name:
RAC-beta serine/threonine-protein kinase
Synonyms:
AKT2 PKB beta Protein kinase B (Akt 2) Protein kinase B, beta RAC-alpha serine/threonine-protein kinase (AKT2) RAC-beta serine/threonine-protein kinase (AKT2) Serine/threonine-protein kinase AKT2 | Serine/threonine-protein kinase Rac alpha/beta
Type:
Enzyme
Mol. Mass.:
55766.64
Organism:
Homo sapiens (Human)
Description:
Residue:
481
  
Inhibitor
Name:
BDBM50243775
Synonyms:
CHEMBL454859 | N,N-dimethyl-1-(6-phenyl-7-(4-((4-(5-(pyridin-2-yl)-4H-1,2,4-triazol-3-yl)piperidin-1-yl)methyl)phenyl)pyrido[2,3-d]pyrimidin-2-yl)piperidin-4-amine
Type:
Small organic molecule
Emp. Form.:
C39H42N10
Mol. Mass.:
650.8178
SMILES:
CN(C)C1CCN(CC1)c1ncc2cc(-c3ccccc3)c(nc2n1)-c1ccc(CN2CCC(CC2)c2nnc([nH]2)-c2ccccn2)cc1
: