Target
Calmodulin-sensitive adenylate cyclase
Ligand
BDBM50243789
Substrate
Meas. Tech.
ChEMBL_492206 (CHEMBL951582)
IC50
>100000±n/a nM
Citation
 Jimenez, MEBush, KPawlik, JSower, LPeterson, JWGilbertson, SR Synthesis and screening of small molecule inhibitors of anthrax edema factor. Bioorg Med Chem Lett 18:4215-8 (2008)  
Target
Name:
Calmodulin-sensitive adenylate cyclase
Synonyms:
CYAA_BACAN | cya
Type:
PROTEIN
Mol. Mass.:
92481.33
Organism:
Bacillus anthracis
Description:
ChEMBL_606615
Residue:
800
  
Inhibitor
Name:
BDBM50243789
Synonyms:
3-Dibenzofuran-4-yl-cyclohex-2-enone | CHEMBL488629
Type:
Small organic molecule
Emp. Form.:
C18H14O2
Mol. Mass.:
262.3026
SMILES:
O=C1CCCC(=C1)c1cccc2c3ccccc3oc12
: