Target
RAC-alpha serine/threonine-protein kinase
Ligand
BDBM50243221
Substrate
Meas. Tech.
ChEMBL_491923 (CHEMBL947431)
IC50
3±n/a nM
Citation
 Siu, TLi, YNagasawa, JLiang, JTehrani, LChua, PJones, REDefeo-Jones, DBarnett, SFRobinson, RG The design and synthesis of potent and cell-active allosteric dual Akt 1 and 2 inhibitors devoid of hERG activity. Bioorg Med Chem Lett 18:4191-4 (2008)  
Target
Name:
RAC-alpha serine/threonine-protein kinase
Synonyms:
AKT phosphorylation (p-AKT) AKT1/PPP1CA C-AKT PKB alpha Protein kinase B Protein kinase B (Akt 1) Protein kinase B alpha Proto-oncogene Akt (Akt1) Proto-oncogene c-Akt (AKT1) RAC-PK-alpha RAC-alpha serine/threonine-protein kinase (AKT1) | RAC-alpha serine/threonine-protein kinase (pAKT)
Type:
Enzyme
Mol. Mass.:
55681.25
Organism:
Homo sapiens (Human)
Description:
P31749
Residue:
480
  
Inhibitor
Name:
BDBM50243221
Synonyms:
2-(4-((4-(5-(6-methoxypyridin-3-yl)-4H-1,2,4-triazol-3-yl)piperidin-1-yl)methyl)phenyl)-3-phenyl-1,6-naphthyridin-5(6H)-one | CHEMBL446966
Type:
Small organic molecule
Emp. Form.:
C34H31N7O2
Mol. Mass.:
569.6556
SMILES:
COc1ccc(cn1)-c1nnc([nH]1)C1CCN(Cc2ccc(cc2)-c2nc3cc[nH]c(=O)c3cc2-c2ccccc2)CC1
: