Target
Dipeptidyl peptidase 2
Ligand
BDBM50243079
Substrate
Meas. Tech.
ChEMBL_492000 (CHEMBL938683)
IC50
7400±n/a nM
Citation
 Van Goethem, SVan der Veken, PDubois, VSoroka, ALambeir, AMChen, XHaemers, AScharpé, SDe Meester, IAugustyns, K Inhibitors of dipeptidyl peptidase 8 and dipeptidyl peptidase 9. Part 2: isoindoline containing inhibitors. Bioorg Med Chem Lett 18:4159-62 (2008)  
Target
Name:
Dipeptidyl peptidase 2
Synonyms:
DAP II DPP2_HUMAN Dipeptidyl aminopeptidase II Dipeptidyl peptidase 2 (DPP2) Dipeptidyl peptidase II (DPP II) Dipeptidyl peptidase II and dipeptidyl peptidase IV (DPP2 and DPP4) carboxytripeptidase dipeptidyl(amino)peptidase II | dipeptidylarylamidase
Type:
Protein
Mol. Mass.:
54339.29
Organism:
Homo sapiens (Human)
Description:
Q9UHL4
Residue:
492
  
Inhibitor
Name:
BDBM50243079
Synonyms:
(2S,3S)-2-amino-1-(5-bromoisoindolin-2-yl)-3-methylpentan-1-one | CHEMBL469878
Type:
Small organic molecule
Emp. Form.:
C14H19BrN2O
Mol. Mass.:
311.217
SMILES:
CC[C@H](C)[C@H](N)C(=O)N1Cc2ccc(Br)cc2C1
: