Target
Dipeptidyl peptidase 4
Ligand
BDBM50243185
Substrate
Meas. Tech.
ChEMBL_491999 (CHEMBL938682)
IC50
>50000±n/a nM
Citation
 Van Goethem, SVan der Veken, PDubois, VSoroka, ALambeir, AMChen, XHaemers, AScharpé, SDe Meester, IAugustyns, K Inhibitors of dipeptidyl peptidase 8 and dipeptidyl peptidase 9. Part 2: isoindoline containing inhibitors. Bioorg Med Chem Lett 18:4159-62 (2008)  
Target
Name:
Dipeptidyl peptidase 4
Synonyms:
ADABP Adenosine deaminase complexing protein 2 CD_antigen=CD26 DPP4 DPPIV Dipeptidyl peptidase 4 (DPP IV) Dipeptidyl peptidase 4 (DPP4) Dipeptidyl peptidase 4 membrane form Dipeptidyl peptidase IV Dipeptidyl peptidase IV (DDP-IV) Dipeptidyl peptidase IV membrane form Dipeptidyl peptidase-IV (DPP-4) T-cell activation antigen CD26 | TP103
Type:
Enzyme
Mol. Mass.:
88271.01
Organism:
Homo sapiens (Human)
Description:
P27487
Residue:
766
  
Inhibitor
Name:
BDBM50243185
Synonyms:
(S)-2-amino-6-(benzylamino)-1-(isoindolin-2-yl)hexan-1-one | CHEMBL520200
Type:
Small organic molecule
Emp. Form.:
C21H27N3O
Mol. Mass.:
337.4586
SMILES:
N[C@@H](CCCCNCc1ccccc1)C(=O)N1Cc2ccccc2C1
: