Target
Dipeptidyl peptidase 8
Ligand
BDBM50243243
Substrate
Meas. Tech.
ChEMBL_491997 (CHEMBL938680)
IC50
710±n/a nM
Citation
 Van Goethem, SVan der Veken, PDubois, VSoroka, ALambeir, AMChen, XHaemers, AScharpé, SDe Meester, IAugustyns, K Inhibitors of dipeptidyl peptidase 8 and dipeptidyl peptidase 9. Part 2: isoindoline containing inhibitors. Bioorg Med Chem Lett 18:4159-62 (2008)  
Target
Name:
Dipeptidyl peptidase 8
Synonyms:
DPP8 DPRP-1 Dipeptidyl peptidase 8 (DPP-8) Dipeptidyl peptidase 8/9 Dipeptidyl peptidase VIII Prolyl dipeptidase DPP8
Type:
Enzyme
Mol. Mass.:
103342.62
Organism:
Homo sapiens (Human)
Description:
Q6V1X1
Residue:
898
  
Inhibitor
Name:
BDBM50243243
Synonyms:
CHEMBL527647 | isoindolin-2-yl((2S,4S)-4-(naphthalen-1-ylamino)pyrrolidin-2-yl)methanone
Type:
Small organic molecule
Emp. Form.:
C23H23N3O
Mol. Mass.:
357.4482
SMILES:
O=C([C@@H]1C[C@@H](CN1)Nc1cccc2ccccc12)N1Cc2ccccc2C1
: