Target
Dipeptidyl peptidase 9
Ligand
BDBM50243187
Substrate
Meas. Tech.
ChEMBL_491998 (CHEMBL938681)
IC50
169±n/a nM
Citation
 Van Goethem, SVan der Veken, PDubois, VSoroka, ALambeir, AMChen, XHaemers, AScharpé, SDe Meester, IAugustyns, K Inhibitors of dipeptidyl peptidase 8 and dipeptidyl peptidase 9. Part 2: isoindoline containing inhibitors. Bioorg Med Chem Lett 18:4159-62 (2008)  
Target
Name:
Dipeptidyl peptidase 9
Synonyms:
DPP9 DPRP-2 Dipeptidyl peptidase 9 (DDP9) Dipeptidyl peptidase 9 (DPP9) Dipeptidyl peptidase IX Dipeptidyl peptidase-like protein 9
Type:
Enzyme
Mol. Mass.:
98260.70
Organism:
Homo sapiens (Human)
Description:
Q86TI2
Residue:
863
  
Inhibitor
Name:
BDBM50243187
Synonyms:
(S)-2-amino-1-(isoindolin-2-yl)-6-(naphthalen-2-ylamino)hexan-1-one | CHEMBL487872
Type:
Small organic molecule
Emp. Form.:
C24H27N3O
Mol. Mass.:
373.4907
SMILES:
N[C@@H](CCCCNc1ccc2ccccc2c1)C(=O)N1Cc2ccccc2C1
: