Target
Dipeptidyl peptidase 9
Ligand
BDBM50243129
Substrate
Meas. Tech.
ChEMBL_491998 (CHEMBL938681)
IC50
70±n/a nM
Citation
 Van Goethem, SVan der Veken, PDubois, VSoroka, ALambeir, AMChen, XHaemers, AScharpé, SDe Meester, IAugustyns, K Inhibitors of dipeptidyl peptidase 8 and dipeptidyl peptidase 9. Part 2: isoindoline containing inhibitors. Bioorg Med Chem Lett 18:4159-62 (2008)  
Target
Name:
Dipeptidyl peptidase 9
Synonyms:
DPP9 DPRP-2 Dipeptidyl peptidase 9 (DDP9) Dipeptidyl peptidase 9 (DPP9) Dipeptidyl peptidase IX Dipeptidyl peptidase-like protein 9
Type:
Enzyme
Mol. Mass.:
98260.70
Organism:
Homo sapiens (Human)
Description:
Q86TI2
Residue:
863
  
Inhibitor
Name:
BDBM50243129
Synonyms:
(2S,3R)-2-amino-1-(5-fluoroisoindolin-2-yl)-3-methylpentan-1-one US11096924, DASH-inhibitors 5291 (8J)
Type:
Small organic molecule
Emp. Form.:
C14H19FN2O
Mol. Mass.:
250.3119
SMILES:
CC[C@@H](C)[C@H](N)C(=O)N1Cc2ccc(F)cc2C1
: