Target
Dipeptidyl peptidase 8
Ligand
BDBM50243410
Substrate
Meas. Tech.
ChEMBL_492001 (CHEMBL938684)
IC50
115000±n/a nM
Citation
 Van der Veken, PDe Meester, IDubois, VSoroka, AVan Goethem, SMaes, MBBrandt, ILambeir, AMChen, XHaemers, AScharpé, SAugustyns, K Inhibitors of dipeptidyl peptidase 8 and dipeptidyl peptidase 9. Part 1: identification of dipeptide derived leads. Bioorg Med Chem Lett 18:4154-8 (2008)  
Target
Name:
Dipeptidyl peptidase 8
Synonyms:
DPP8 DPRP-1 Dipeptidyl peptidase 8 (DPP-8) Dipeptidyl peptidase 8/9 Dipeptidyl peptidase VIII Prolyl dipeptidase DPP8
Type:
Enzyme
Mol. Mass.:
103342.62
Organism:
Homo sapiens (Human)
Description:
Q6V1X1
Residue:
898
  
Inhibitor
Name:
BDBM50243410
Synonyms:
(S)-2-amino-3-phenyl-1-(pyrrolidin-1-yl)propan-1-one | CHEMBL453918
Type:
Small organic molecule
Emp. Form.:
C13H18N2O
Mol. Mass.:
218.2948
SMILES:
N[C@@H](Cc1ccccc1)C(=O)N1CCCC1
: