Target
Trypanothione reductase
Ligand
BDBM50240625
Substrate
Meas. Tech.
ChEMBL_491413 (CHEMBL945376)
Ki
2000±n/a nM
Citation
 Galarreta, BCSifuentes, RCarrillo, AKSanchez, LAmado, Mdel RMaruenda, H The use of natural product scaffolds as leads in the search for trypanothione reductase inhibitors. Bioorg Med Chem 16:6689-95 (2008)  
Target
Name:
Trypanothione reductase
Synonyms:
N(1),N(8)-bis(glutathionyl)spermidine reductase TR | TYTR_TRYCR
Type:
Homodimer; oxidoreductase
Mol. Mass.:
53868.26
Organism:
Trypanosoma cruzi
Description:
Residue:
492
  
Inhibitor
Name:
BDBM50240625
Synonyms:
4-(2,3,4,9-Tetrahydro-1H-beta-carbolin-1-yl)-benzonitrile CHEMBL78448
Type:
Small organic molecule
Emp. Form.:
C18H15N3
Mol. Mass.:
273.3318
SMILES:
N#Cc1ccc(cc1)C1NCCc2c1[nH]c1ccccc21
: