Target
Trypanothione reductase
Ligand
BDBM50178807
Substrate
Meas. Tech.
ChEMBL_491413 (CHEMBL945376)
Ki
1700±n/a nM
Citation
 Galarreta, BCSifuentes, RCarrillo, AKSanchez, LAmado, Mdel RMaruenda, H The use of natural product scaffolds as leads in the search for trypanothione reductase inhibitors. Bioorg Med Chem 16:6689-95 (2008)  
Target
Name:
Trypanothione reductase
Synonyms:
N(1),N(8)-bis(glutathionyl)spermidine reductase TR | TYTR_TRYCR
Type:
Homodimer; oxidoreductase
Mol. Mass.:
53868.26
Organism:
Trypanosoma cruzi
Description:
Residue:
492
  
Inhibitor
Name:
BDBM50178807
Synonyms:
3,4-dichloro-N-(3-(5-chloro-2-(phenylthio)phenylamino)propyl)-N,N-dimethylbenzenaminium | CHEMBL382522
Type:
Small organic molecule
Emp. Form.:
C23H24Cl3N2S
Mol. Mass.:
466.874
SMILES:
C[N+](C)(CCCNc1cc(Cl)ccc1Sc1ccccc1)c1ccc(Cl)c(Cl)c1
: