Target
Cathepsin B
Ligand
BDBM50252489
Substrate
Meas. Tech.
ChEMBL_487505 (CHEMBL1016567)
IC50
23±n/a nM
Citation
 Kim, SHJhon, DJSong, JHNo, JSKang, NS Effect of novel N-cyano-tetrahydro-pyridazine compounds, a class of cathepsin K inhibitors, on the bone resorptive activity of mature osteoclasts. Bioorg Med Chem Lett 18:3988-91 (2008)  
Target
Name:
Cathepsin B
Synonyms:
APP secretase CATB_HUMAN CTSB Cathepsin B light chain | Cathepsin B1
Type:
Enzyme
Mol. Mass.:
37819.69
Organism:
Homo sapiens (Human)
Description:
gi_63102437
Residue:
339
  
Inhibitor
Name:
BDBM50252489
Synonyms:
2-(3-methyl-2-(3-(trifluoromethyl)phenylamino)butanoyl)piperazine-1-carbonitrile | CHEMBL521987
Type:
Small organic molecule
Emp. Form.:
C17H21F3N4O
Mol. Mass.:
354.37
SMILES:
CC(C)C(Nc1cccc(c1)C(F)(F)F)C(=O)N1CCCCN1C#N
: