Target
Cathepsin S
Ligand
BDBM50252545
Substrate
Meas. Tech.
ChEMBL_487680 (CHEMBL1009448)
IC50
99±n/a nM
Citation
 Irie, OEhara, TIwasaki, AYokokawa, FSakaki, JHirao, HKanazawa, TTeno, NHoriuchi, MUmemura, IGunji, HMasuya, KHitomi, YIwasaki, GNonomura, KTanabe, KFukaya, HKosaka, TSnell, CRHallett, A Discovery of selective and nonpeptidic cathepsin S inhibitors. Bioorg Med Chem Lett 18:3959-62 (2008)  
Target
Name:
Cathepsin S
Synonyms:
CATS_HUMAN Cathepsin S (Cat S) | cathepsin S preproprotein
Type:
Protein
Mol. Mass.:
37507.38
Organism:
Homo sapiens (Human)
Description:
P25774
Residue:
331
  
Inhibitor
Name:
BDBM50252545
Synonyms:
6-(4-chlorobenzyl)-7-(2-cyclooctylethyl)-7H-pyrrolo[2,3-d]pyrimidine-2-carbonitrile | CHEMBL522326
Type:
Small organic molecule
Emp. Form.:
C24H27ClN4
Mol. Mass.:
406.951
SMILES:
Clc1ccc(Cc2cc3cnc(nc3n2CCC2CCCCCCC2)C#N)cc1
: