Target
Cathepsin S
Ligand
BDBM50252504
Substrate
Meas. Tech.
ChEMBL_487680 (CHEMBL1009448)
IC50
150±n/a nM
Citation
 Irie, OEhara, TIwasaki, AYokokawa, FSakaki, JHirao, HKanazawa, TTeno, NHoriuchi, MUmemura, IGunji, HMasuya, KHitomi, YIwasaki, GNonomura, KTanabe, KFukaya, HKosaka, TSnell, CRHallett, A Discovery of selective and nonpeptidic cathepsin S inhibitors. Bioorg Med Chem Lett 18:3959-62 (2008)  
Target
Name:
Cathepsin S
Synonyms:
CATS_HUMAN Cathepsin S (Cat S) | cathepsin S preproprotein
Type:
Protein
Mol. Mass.:
37507.38
Organism:
Homo sapiens (Human)
Description:
P25774
Residue:
331
  
Inhibitor
Name:
BDBM50252504
Synonyms:
6-(4-chlorobenzyl)-7-(3-cyclohexylpropyl)-7H-pyrrolo[2,3-d]pyrimidine-2-carbonitrile | CHEMBL494886
Type:
Small organic molecule
Emp. Form.:
C23H25ClN4
Mol. Mass.:
392.924
SMILES:
Clc1ccc(Cc2cc3cnc(nc3n2CCCC2CCCCC2)C#N)cc1
: