Target
Cathepsin K
Ligand
BDBM50252653
Substrate
Meas. Tech.
ChEMBL_487681 (CHEMBL1009449)
IC50
>1000±n/a nM
Citation
 Irie, OEhara, TIwasaki, AYokokawa, FSakaki, JHirao, HKanazawa, TTeno, NHoriuchi, MUmemura, IGunji, HMasuya, KHitomi, YIwasaki, GNonomura, KTanabe, KFukaya, HKosaka, TSnell, CRHallett, A Discovery of selective and nonpeptidic cathepsin S inhibitors. Bioorg Med Chem Lett 18:3959-62 (2008)  
Target
Name:
Cathepsin K
Synonyms:
CATK_HUMAN CTSO Cathepsin O Cathepsin X
Type:
Enzyme
Mol. Mass.:
36975.68
Organism:
Homo sapiens (Human)
Description:
P43235
Residue:
329
  
Inhibitor
Name:
BDBM50252653
Synonyms:
7-(2-cyclohexylethyl)-6-((methyl(phenyl)amino)methyl)-7H-pyrrolo[2,3-d]pyrimidine-2-carbonitrile | CHEMBL493244
Type:
Small organic molecule
Emp. Form.:
C23H27N5
Mol. Mass.:
373.494
SMILES:
CN(Cc1cc2cnc(nc2n1CCC1CCCCC1)C#N)c1ccccc1
: