Target
Cathepsin K
Ligand
BDBM50252504
Substrate
Meas. Tech.
ChEMBL_487681 (CHEMBL1009449)
IC50
>1000±n/a nM
Citation
 Irie, OEhara, TIwasaki, AYokokawa, FSakaki, JHirao, HKanazawa, TTeno, NHoriuchi, MUmemura, IGunji, HMasuya, KHitomi, YIwasaki, GNonomura, KTanabe, KFukaya, HKosaka, TSnell, CRHallett, A Discovery of selective and nonpeptidic cathepsin S inhibitors. Bioorg Med Chem Lett 18:3959-62 (2008)  
Target
Name:
Cathepsin K
Synonyms:
CATK_HUMAN CTSO Cathepsin O Cathepsin X
Type:
Enzyme
Mol. Mass.:
36975.68
Organism:
Homo sapiens (Human)
Description:
P43235
Residue:
329
  
Inhibitor
Name:
BDBM50252504
Synonyms:
6-(4-chlorobenzyl)-7-(3-cyclohexylpropyl)-7H-pyrrolo[2,3-d]pyrimidine-2-carbonitrile | CHEMBL494886
Type:
Small organic molecule
Emp. Form.:
C23H25ClN4
Mol. Mass.:
392.924
SMILES:
Clc1ccc(Cc2cc3cnc(nc3n2CCCC2CCCCC2)C#N)cc1
: