Target
Insulin-like growth factor 1 receptor
Ligand
BDBM50252300
Substrate
Meas. Tech.
ChEMBL_487710 (CHEMBL1022735)
IC50
100±n/a nM
Citation
 Zimmermann, KWittman, MDSaulnier, MGVelaparthi, ULangley, DRSang, XFrennesson, DCarboni, JLi, AGreer, AGottardis, MAttar, RMYang, ZBalimane, PDiscenza, LNVyas, D Balancing oral exposure with Cyp3A4 inhibition in benzimidazole-based IGF-IR inhibitors. Bioorg Med Chem Lett 18:4075-80 (2008)  
Target
Name:
Insulin-like growth factor 1 receptor
Synonyms:
CD_antigen=CD221 IGF1R Insulin-like growth factor 1 receptor (IGF1R) Insulin-like growth factor 1 receptor alpha chain Insulin-like growth factor I receptor | Insulin-like growth factor receptor (IGFR)
Type:
Protein
Mol. Mass.:
154776.79
Organism:
Homo sapiens (Human)
Description:
P08069
Residue:
1367
  
Inhibitor
Name:
BDBM50252300
Synonyms:
(S)-4-(2-(3-chlorophenyl)-2-hydroxyethylamino)-3-(6-(4-(4-(cyclopropanecarbonyl)piperazin-1-yl)piperidin-1-yl)-4-methyl-1H-benzo[d]imidazol-2-yl)pyridin-2(1H)-one | CHEMBL510298
Type:
Small organic molecule
Emp. Form.:
C34H40ClN7O3
Mol. Mass.:
630.18
SMILES:
Cc1cc(cc2[nH]c(nc12)-c1c(NC[C@@H](O)c2cccc(Cl)c2)cc[nH]c1=O)N1CCC(CC1)N1CCN(CC1)C(=O)C1CC1
: