Target
Cytochrome P450 3A4
Ligand
BDBM50252293
Substrate
Meas. Tech.
ChEMBL_487712 (CHEMBL1022737)
IC50
4.1±n/a nM
Citation
 Zimmermann, KWittman, MDSaulnier, MGVelaparthi, ULangley, DRSang, XFrennesson, DCarboni, JLi, AGreer, AGottardis, MAttar, RMYang, ZBalimane, PDiscenza, LNVyas, D Balancing oral exposure with Cyp3A4 inhibition in benzimidazole-based IGF-IR inhibitors. Bioorg Med Chem Lett 18:4075-80 (2008)  
Target
Name:
Cytochrome P450 3A4
Synonyms:
Albendazole monooxygenase CP3A4_HUMAN CYP3A4 CYPIIIA4 Cytochrome P450 3A4 (CYP3A4) Nifedipine oxidase Taurochenodeoxycholate 6-alpha-hydroxylase
Type:
Enzyme
Mol. Mass.:
57349.57
Organism:
Homo sapiens (Human)
Description:
Residue:
503
  
Inhibitor
Name:
BDBM50252293
Synonyms:
(S)-4-(2-(3-chlorophenyl)-2-hydroxyethylamino)-3-(4-methyl-6-(4-morpholinopiperidin-1-yl)-1H-benzo[d]imidazol-2-yl)pyridin-2(1H)-one | CHEMBL482126
Type:
Small organic molecule
Emp. Form.:
C30H35ClN6O3
Mol. Mass.:
563.09
SMILES:
Cc1cc(cc2[nH]c(nc12)-c1c(NC[C@@H](O)c2cccc(Cl)c2)cc[nH]c1=O)N1CCC(CC1)N1CCOCC1
: